{"text_format":"1","workbook":"xlsx","n_sheets":9,"sheets":["はじめに","学校番号","【入力1】チーム情報","【入力2】部員情報","【申込】高総体","【申込】選手権","【申込】新人戦","【メンバー用紙】共通","memo"],"not_rendered":{"charts":0,"images":7,"macros":1,"external_links":0,"defined_names":15,"comments":0,"pivot_tables":0},"unopened":[],"bounds":{"document_bytes":16777216,"sheet_cells":100000,"rows_first":2000,"rows_last":500,"rows_between":2000,"halvings":0,"cell_chars":16384,"cell_head_chars":4096},"cells_cut":0,"cells_raw":0,"read":"whole","date_system":"1900"}

{"sheet":"はじめに","index":0,"n_rows":53,"n_cols":32,"rows_kept":53,"cut":false,"hidden":false,"merged":[[35,1,36,20],[29,1,30,20],[32,1,33,20]]}
[null,null,null,null,null,null,null,null,null,null,null,null,null,null,null,null,null,null,null,null,null,null,null,null,null,null,null,null,null,null,null,{"$f":"【申込】高総体!$X$4","v":"ver.2024_1a"}]
[null,"注意事項　2024年度～"]
["・","このEntrysheetは、関数およびマクロ（申込書およびメンバー用紙作成マクロ）が組まれています。"]
["・","ファイル名の変更は可能ですが、極力変更せずにご利用ください。"]
["・","ファイル内の各シート名の変更や移動（タブの並び順を入れ替えるも含む）は行わないでください。"]
["・","行や列の挿入・削除は行わないでください。"]
["・","こちらのファイル内各シートに、別ファイルからデータの貼り付けをする場合は、［形式を選択して貼り付け］→［値］"]
[null,"で行ってください。"]
["・","背番号「00」については、ｼｽﾃﾑの都合上「0」で入力をお願いします。チーム情報等の入力完了後に、【申込】〇〇〇ｼｰﾄ上で、"]
[null,"新たに保存（作成）されるファイル（.xlsx）を開き、「’00」を手入力し、訂正してください。"]
{"$rows_left_out":44}
{"sheet":"学校番号","index":1,"n_rows":182,"n_cols":13,"rows_kept":182,"cut":false,"hidden":false,"merged":[[142,1,154,1],[155,1,163,1],[164,1,172,1],[1,5,2,5],[3,1,71,1],[104,1,116,1],[117,1,141,1],[2,3,2,4],[1,3,1,4],[1,1,2,1],[72,1,103,1],[1,10,2,10],[1,11,2,11],[1,7,2,7],[1,9,2,9],[1,2,2,2],[1,8,2,8],[1,6,2,6]]}
[null,null,1,2,3,4,5,6,7,8,9,10,11]
[null,"地区","学校番号","全日制",null,"チームＩＤ","郵便番号","住所","電話番号","ＦＡＸ","校名略称","ｶﾞｯｺｳﾒｲ　（半角入力）"]
[null,null,null,"高等学校名"]
[{"$f":"ROW(A1)","v":1},"仙塩",{"$f":"A4","v":1},"宮城県仙台第一高等学校","男","T450936191","984-8561","仙台市若林区元茶畑4","022-257-4501","022-257-4503","仙台第一","ﾐﾔｷﾞｹﾝｾﾝﾀﾞｲﾀﾞｲｲﾁ","ｺｳﾄｳｶﾞｯｺｳ"]
[{"$f":"ROW(A2)","v":2},null,{"$f":"A5","v":2},"宮城県仙台第一高等学校","女","T462140144","984-8561","仙台市若林区元茶畑4","022-257-4501","022-257-4503","仙台第一","ﾐﾔｷﾞｹﾝｾﾝﾀﾞｲﾀﾞｲｲﾁ","ｺｳﾄｳｶﾞｯｺｳ"]
[3,null,3,"宮城県仙台第二高等学校","男","T451085083","980-8631","仙台市青葉区川内澱橋通1","022-221-5626","022-221-5628","仙台第二","ﾐﾔｷﾞｹﾝｾﾝﾀﾞｲﾀﾞｲﾆ","ｺｳﾄｳｶﾞｯｺｳ"]
[4,null,4,"宮城県仙台第二高等学校","女","T462216170","980-8631","仙台市青葉区川内澱橋通1","022-221-5626","022-221-5628","仙台第二","ﾐﾔｷﾞｹﾝｾﾝﾀﾞｲﾀﾞｲﾆ","ｺｳﾄｳｶﾞｯｺｳ"]
[5,null,5,"宮城県仙台第三高等学校","男","T450362299","983-0824","仙台市宮城野区鶴ヶ谷1-19","022-251-1246","022-251-1247","仙台第三","ﾐﾔｷﾞｹﾝｾﾝﾀﾞｲﾀﾞｲｻﾝ","ｺｳﾄｳｶﾞｯｺｳ"]
[6,null,6,"宮城県仙台第三高等学校","女","T460946581","983-0824","仙台市宮城野区鶴ヶ谷1-19","022-251-1246","022-251-1247","仙台第三","ﾐﾔｷﾞｹﾝｾﾝﾀﾞｲﾀﾞｲｻﾝ","ｺｳﾄｳｶﾞｯｺｳ"]
[7,null,7,"宮城県宮城第一高等学校","女","T460002002","980-0871","仙台市青葉区八幡1-6-2","022-227-3211","022-227-3213","宮城第一","ﾐﾔｷﾞｹﾝﾐﾔｷﾞﾀﾞｲｲﾁ","ｺｳﾄｳｶﾞｯｺｳ"]
{"$rows_left_out":173}
{"sheet":"【入力1】チーム情報","index":2,"n_rows":38,"n_cols":18,"rows_kept":38,"cut":false,"hidden":false,"merged":[[4,2,4,3],[3,2,3,3],[3,4,3,6],[8,1,8,2],[7,1,7,2],[6,1,6,2],[4,4,4,5],[12,1,12,2],[11,1,11,2],[10,1,10,2],[9,1,9,2],[34,5,34,7]]}
[null,1,2,3,4,5,6,7,8,10,11,12,13,14,15,18,19,20]
[1,{"$f":"YEAR(EDATE($H$2,-3))","v":2023},"チームおよびスタッフ情報入力シート",null,null,null,null,{"$f":"TODAY()","v":"2024-03-05"}]
[2]
[3,"学校番号","チームID",null,"学校名 （ﾌﾘｶﾞﾅ）",null,null,"学校長名"]
[4,null,{"$f":"VLOOKUP(B5,学校番号!$C$4:$N$173,4,1)","v":{"$error":"#N/A"}},null,{"$f":"VLOOKUP(B5,学校番号!$C$4:$N$173,10,1)&\" \"&VLOOKUP(B5,学校番号!$C$4:$N$173,11,1)&CHAR(10) &VLOOKUP(B5,学校番号!$C$4:$N$173,2,1)","v":{"$error":"#N/A"}},null,{"$f":"IFERROR(VLOOKUP(B5,学校番号!$C$4:$N$173,3,1)&\"子\",\"\")","v":""},null,null,{"$f":"VLOOKUP(B5,学校番号!$C$4:$N$173,9,1)","v":{"$error":"#N/A"}}]
[5,null,null,null,null,null,null,"ver.2024_1a"]
[6,"スタッフ",null,"メンバーID","氏　名　［スタッフ］"]
[7,"監督"]
[8,"コーチ"]
[9,"Ａコーチ"]
{"$rows_left_out":29}
{"sheet":"【入力2】部員情報","index":3,"n_rows":104,"n_cols":24,"rows_kept":104,"cut":false,"hidden":false,"merged":[[0,18,2,22]]}
[null,1,2,3,4,5,6,7,8,9,10,11,12,13,14,15,16,null,"「公式大会番号」に番号が入力された選手が番号順に表示されます↓（確認用）"]
[null,"■ 所属選手名簿を下表に作成してください。（チーム内選手全員分が入力できます）",null,null,null,null,null,null,null,null,null,null,"・・・塗りつぶし部分を入力"]
[null,null,"半角","半角","半角",null,"半角",null,null,null,null,"半角","「中」以降、入力なし"]
[null,"通し番号","学年","個人番号","公式大会番号","ポジション","身長","氏","名","ふりがな（氏）","ふりがな（名）","メンバーID","出身中学",null,null,{"$f":"C4","v":"学年"},{"$f":"G4","v":"身長"},null,null,"公式番号","確認用氏名","ポジ","身長"]
[null,{"$f":"IF(C5<>\"\",ROW(B1),\"\")","v":""},null,null,null,null,null,null,null,null,null,null,null,{"$f":"H5&\"　\"&I5","v":"　"},{"$f":"J5&\"　\"&K5","v":"　"},0,0,null,1,{"$f":"IFERROR(SMALL($E$5:$E$104,ROW(A1)), \"\")","v":""},{"$f":"IF(T5<>\"\",VLOOKUP(T5,【入力2】部員情報!$E$5:$Q$104,10,0),\"\")","v":""},{"$f":"IF(T5<>\"\",VLOOKUP(T5,【入力2】部員情報!$E$5:$Q$104,2,0),\"\")","v":""},{"$f":"IF(T5<>\"\",VLOOKUP(T5,【入力2】部員情報!$E$5:$Q$104,3,0),\"\")","v":""}]
[null,{"$f":"IF(C6<>\"\",ROW(B2),\"\")","v":""},null,null,null,null,null,null,null,null,null,null,null,{"$f":"H6&\"　\"&I6","v":"　"},{"$f":"J6&\"　\"&K6","v":"　"},0,0,null,2,{"$f":"IFERROR(SMALL($E$5:$E$104,ROW(A2)), \"\")","v":""},{"$f":"IF(T6<>\"\",VLOOKUP(T6,【入力2】部員情報!$E$5:$Q$104,10,0),\"\")","v":""},{"$f":"IF(T6<>\"\",VLOOKUP(T6,【入力2】部員情報!$E$5:$Q$104,2,0),\"\")","v":""},{"$f":"IF(T6<>\"\",VLOOKUP(T6,【入力2】部員情報!$E$5:$Q$104,3,0),\"\")","v":""}]
[null,"",null,null,null,null,null,null,null,null,null,null,null,"　","　",0,0,null,3,"",{"$f":"IF(T7<>\"\",VLOOKUP(T7,【入力2】部員情報!$E$5:$Q$104,10,0),\"\")","v":""},{"$f":"IF(T7<>\"\",VLOOKUP(T7,【入力2】部員情報!$E$5:$Q$104,2,0),\"\")","v":""},{"$f":"IF(T7<>\"\",VLOOKUP(T7,【入力2】部員情報!$E$5:$Q$104,3,0),\"\")","v":""}]
[null,"",null,null,null,null,null,null,null,null,null,null,null,"　","　",0,0,null,4,"",{"$f":"IF(T8<>\"\",VLOOKUP(T8,【入力2】部員情報!$E$5:$Q$104,10,0),\"\")","v":""},{"$f":"IF(T8<>\"\",VLOOKUP(T8,【入力2】部員情報!$E$5:$Q$104,2,0),\"\")","v":""},{"$f":"IF(T8<>\"\",VLOOKUP(T8,【入力2】部員情報!$E$5:$Q$104,3,0),\"\")","v":""}]
[null,"",null,null,null,null,null,null,null,null,null,null,null,"　","　",0,0,null,5,"",{"$f":"IF(T9<>\"\",VLOOKUP(T9,【入力2】部員情報!$E$5:$Q$104,10,0),\"\")","v":""},{"$f":"IF(T9<>\"\",VLOOKUP(T9,【入力2】部員情報!$E$5:$Q$104,2,0),\"\")","v":""},{"$f":"IF(T9<>\"\",VLOOKUP(T9,【入力2】部員情報!$E$5:$Q$104,3,0),\"\")","v":""}]
[null,"",null,null,null,null,null,null,null,null,null,null,null,"　","　",0,0,null,6,"",{"$f":"IF(T10<>\"\",VLOOKUP(T10,【入力2】部員情報!$E$5:$Q$104,10,0),\"\")","v":""},{"$f":"IF(T10<>\"\",VLOOKUP(T10,【入力2】部員情報!$E$5:$Q$104,2,0),\"\")","v":""},{"$f":"IF(T10<>\"\",VLOOKUP(T10,【入力2】部員情報!$E$5:$Q$104,3,0),\"\")","v":""}]
{"$rows_left_out":95}
{"sheet":"【申込】高総体","index":4,"n_rows":40,"n_cols":27,"rows_kept":40,"cut":false,"hidden":false,"merged":[[39,14,39,21],[39,4,39,13],[17,19,17,22],[18,19,18,22],[19,19,19,22],[14,16,14,18],[18,16,18,18],[14,19,14,23],[17,16,17,18],[16,13,16,15],[17,13,17,15],[18,13,18,15],[19,13,19,15],[16,16,16,18],[16,19,16,22],[20,19,20,22],[30,16,30,18],[31,16,31,18],[32,16,32,18],[25,16,25,18],[23,16,23,18],[34,8,35,22],[28,16,28,18],[21,19,21,22],[38,0,38,1],[26,16,26,18],[27,16,27,18],[31,19,31,22],[25,19,25,22],[26,19,26,22],[27,19,27,22],[28,19,28,22],[30,19,30,22],[29,19,29,22],[32,19,32,22],[37,0,37,23],[29,13,29,15],[30,13,30,15],[31,13,31,15],[34,0,34,7],[25,1,25,6],[26,1,26,6],[27,1,27,6],[28,1,28,6],[29,1,29,6],[30,1,30,6],[31,1,31,6],[32,7,32,9],[14,1,14,6],[13,3,13,9],[11,3,12,9],[10,3,10,9],[8,3,9,9],[15,7,15,9],[8,13,9,23],[11,13,12,23],[9,10,9,12],[8,10,8,12],[10,10,10,12],[15,16,15,18],[15,19,15,22],[13,13,13,23],[13,10,13,12],[11,10,11,12],[12,10,12,12],[14,10,14,12],[13,0,13,2],[10,0,10,2],[15,10,15,12],[15,1,15,6],[8,0,8,2],[14,13,14,15],[17,1,17,6],[18,1,18,6],[19,1,19,6],[20,1,20,6],[21,1,21,6],[22,1,22,6],[23,1,23,6],[24,1,24,6],[0,0,0,23],[1,0,1,23],[2,0,2,23],[5,12,6,23],[5,0,6,1],[4,0,4,1],[7,13,7,17],[7,19,7,23],[4,13,4,16],[5,2,6,8],[5,9,6,9],[4,2,4,9],[7,0,7,3],[7,4,7,9],[4,10,7,11],[10,13,10,23],[20,7,20,9],[31,7,31,9],[21,16,21,18],[24,16,24,18],[9,0,9,2],[11,0,11,2],[12,0,12,2],[21,7,21,9],[32,1,32,6],[16,7,16,9],[17,7,17,9],[18,7,18,9],[19,7,19,9],[14,7,14,9],[23,7,23,9],[24,7,24,9],[25,7,25,9],[22,7,22,9],[26,7,26,9],[27,7,27,9],[28,7,28,9],[29,7,29,9],[30,7,30,9],[16,1,16,6],[14,25,14,26],[26,10,26,12],[27,10,27,12],[28,10,28,12],[29,10,29,12],[30,10,30,12],[31,10,31,12],[24,13,24,15],[25,13,25,15],[26,13,26,15],[27,13,27,15],[28,13,28,15],[16,10,16,12],[17,10,17,12],[18,10,18,12],[19,10,19,12],[15,13,15,15],[19,16,19,18],[20,16,20,18],[22,16,22,18],[29,16,29,18],[20,10,20,12],[21,10,21,12],[22,10,22,12],[22,19,22,22],[23,19,23,22],[24,19,24,22],[22,13,22,15],[23,13,23,15],[32,13,32,15],[32,10,32,12],[20,13,20,15],[21,13,21,15],[23,10,23,12],[24,10,24,12],[25,10,25,12]]}
[{"$f":"【入力1】チーム情報!$B$2-1951","v":72}]
["バスケットボール競技"]
["【　参加申込書　】"]
[null,null,null,null,null,null,null,null,null,null,null,null,null,null,null,null,null,null,null,null,null,null,null,{"$f":"【入力1】チーム情報!$H$6","v":"ver.2024_1a"}]
["ﾌﾘｶﾞﾅ",null,{"$f":"IFERROR(VLOOKUP(【入力1】チーム情報!$B$5,学校番号!$C$4:$M$173,10,1)&\" \"&VLOOKUP(【入力1】チーム情報!$B$5,学校番号!$C$4:$M$173,11,1),\"\")","v":""},null,null,null,null,null,null,null,"学校　　所在地",null,"〒",{"$f":"IFERROR(VLOOKUP(【入力1】チーム情報!$B$5,学校番号!$C$4:$M$173,5,1),\"\")","v":""}]
["学校名",null,{"$f":"IFERROR(VLOOKUP(【入力1】チーム情報!$B$5,学校番号!$C$4:$M$173,2,1),\"\")","v":""},null,null,null,null,null,null,{"$f":"IFERROR(VLOOKUP(【入力1】チーム情報!$B$5,学校番号!$C$4:$M$173,3,1)&\"子\",\"\")","v":""},null,null,{"$f":"IFERROR(VLOOKUP(【入力1】チーム情報!$B$5,学校番号!$C$4:$M$173,6,1),\"\")","v":""},null,null,null,null,null,null,null,null,null,null,null,null,{"$f":"VLOOKUP(【入力1】チーム情報!B5,学校番号!$C$4:$N$173,9,1)","v":{"$error":"#N/A"}}]
[]
["チーム登録番号",null,null,null,{"$f":"IFERROR(VLOOKUP(【入力1】チーム情報!$B$5,学校番号!$C$4:$M$173,4,1),\"\")","v":""},null,null,null,null,null,null,null,"TEL",{"$f":"IFERROR(VLOOKUP(【入力1】チーム情報!$B$5,学校番号!$C$4:$M$173,7,1),\"\")","v":""},null,null,null,null,"FAX",{"$f":"IFERROR(VLOOKUP(【入力1】チーム情報!$B$5,学校番号!$C$4:$M$173,8,1),\"\")","v":""}]
["監督",null,null,{"$f":"【入力1】チーム情報!$E$8","v":0},null,null,null,null,null,null,"コーチ",null,null,{"$f":"【入力1】チーム情報!$E$9","v":0}]
["氏名",null,null,null,null,null,null,null,null,null,"氏名"]
{"$rows_left_out":31}
{"sheet":"【申込】選手権","index":5,"n_rows":38,"n_cols":27,"rows_kept":38,"cut":false,"hidden":false,"merged":[[0,0,0,23],[1,0,1,23],[2,0,2,23],[4,0,4,1],[4,2,4,9],[4,10,7,11],[4,13,4,16],[5,0,6,1],[5,2,6,8],[5,9,6,9],[5,12,6,23],[7,0,7,3],[7,4,7,9],[7,13,7,17],[7,19,7,23],[8,0,8,2],[8,3,9,9],[8,10,8,12],[8,13,9,23],[9,0,9,2],[9,10,9,12],[10,0,10,2],[10,3,10,9],[10,10,10,12],[10,13,10,23],[11,0,11,2],[11,3,12,9],[11,10,11,12],[11,13,12,23],[12,0,12,2],[12,10,12,12],[13,0,13,2],[13,3,13,9],[13,10,13,12],[13,13,13,23],[16,1,16,6],[16,7,16,9],[16,10,16,12],[16,13,16,15],[16,16,16,18],[16,19,16,22],[17,1,17,6],[17,7,17,9],[17,10,17,12],[17,13,17,15],[17,16,17,18],[14,1,14,6],[14,7,14,9],[14,10,14,12],[14,13,14,15],[14,16,14,18],[14,19,14,23],[15,1,15,6],[15,7,15,9],[15,10,15,12],[15,13,15,15],[15,16,15,18],[15,19,15,22],[19,1,19,6],[19,7,19,9],[19,10,19,12],[19,13,19,15],[19,16,19,18],[19,19,19,22],[17,19,17,22],[18,1,18,6],[18,7,18,9],[18,10,18,12],[18,13,18,15],[18,16,18,18],[18,19,18,22],[21,1,21,6],[21,7,21,9],[21,10,21,12],[21,13,21,15],[21,16,21,18],[21,19,21,22],[20,1,20,6],[20,7,20,9],[20,10,20,12],[20,13,20,15],[20,16,20,18],[20,19,20,22],[23,1,23,6],[23,7,23,9],[23,10,23,12],[23,13,23,15],[23,16,23,18],[23,19,23,22],[22,1,22,6],[22,7,22,9],[22,10,22,12],[22,13,22,15],[22,16,22,18],[22,19,22,22],[25,1,25,6],[25,7,25,9],[25,10,25,12],[25,13,25,15],[25,16,25,18],[25,19,25,22],[24,1,24,6],[24,7,24,9],[24,10,24,12],[24,13,24,15],[24,16,24,18],[24,19,24,22],[27,1,27,6],[27,7,27,9],[27,10,27,12],[27,13,27,15],[27,16,27,18],[27,19,27,22],[26,1,26,6],[26,7,26,9],[26,10,26,12],[26,13,26,15],[26,16,26,18],[26,19,26,22],[29,7,29,9],[29,10,29,12],[29,13,29,15],[29,16,29,18],[29,19,29,22],[28,1,28,6],[28,7,28,9],[28,10,28,12],[28,13,28,15],[28,16,28,18],[28,19,28,22],[14,25,14,26],[35,0,35,23],[36,0,36,1],[37,4,37,13],[37,14,37,21],[32,1,32,6],[32,7,32,9],[32,10,32,12],[32,13,32,15],[32,16,32,18],[32,19,32,22],[31,1,31,6],[31,7,31,9],[31,10,31,12],[31,13,31,15],[31,16,31,18],[31,19,31,22],[30,1,30,6],[30,7,30,9],[30,10,30,12],[30,13,30,15],[30,16,30,18],[30,19,30,22],[29,1,29,6]]}
[{"$f":"【入力1】チーム情報!$B$2-1978","v":45}]
[{"$f":"【入力1】チーム情報!$B$2-1947","v":76}]
["【　参加申込書　】"]
[null,null,null,null,null,null,null,null,null,null,null,null,null,null,null,null,null,null,null,null,null,null,null,{"$f":"【入力1】チーム情報!$H$6","v":"ver.2024_1a"}]
["ﾌﾘｶﾞﾅ",null,{"$f":"IFERROR(VLOOKUP(【入力1】チーム情報!$B$5,学校番号!$C$4:$M$173,10,1)&\" \"&VLOOKUP(【入力1】チーム情報!$B$5,学校番号!$C$4:$M$173,11,1),\"\")","v":""},null,null,null,null,null,null,null,"学校　　所在地",null,"〒",{"$f":"IFERROR(VLOOKUP(【入力1】チーム情報!$B$5,学校番号!$C$4:$M$173,5,1),\"\")","v":""}]
["学校名",null,{"$f":"IFERROR(VLOOKUP(【入力1】チーム情報!$B$5,学校番号!$C$4:$M$173,2,1),\"\")","v":""},null,null,null,null,null,null,{"$f":"IFERROR(VLOOKUP(【入力1】チーム情報!$B$5,学校番号!$C$4:$M$173,3,1)&\"子\",\"\")","v":""},null,null,{"$f":"IFERROR(VLOOKUP(【入力1】チーム情報!$B$5,学校番号!$C$4:$M$173,6,1),\"\")","v":""},null,null,null,null,null,null,null,null,null,null,null,null,{"$f":"VLOOKUP(【入力1】チーム情報!B5,学校番号!$C$4:$N$173,9,1)","v":{"$error":"#N/A"}}]
[]
["チーム登録番号",null,null,null,{"$f":"IFERROR(VLOOKUP(【入力1】チーム情報!$B$5,学校番号!$C$4:$M$173,4,1),\"\")","v":""},null,null,null,null,null,null,null,"TEL",{"$f":"IFERROR(VLOOKUP(【入力1】チーム情報!$B$5,学校番号!$C$4:$M$173,7,1),\"\")","v":""},null,null,null,null,"FAX",{"$f":"IFERROR(VLOOKUP(【入力1】チーム情報!$B$5,学校番号!$C$4:$M$173,8,1),\"\")","v":""}]
["監督",null,null,{"$f":"【入力1】チーム情報!$E$8","v":0},null,null,null,null,null,null,"コーチ",null,null,{"$f":"【入力1】チーム情報!$E$9","v":0}]
["氏名",null,null,null,null,null,null,null,null,null,"氏名"]
{"$rows_left_out":29}
{"sheet":"【申込】新人戦","index":6,"n_rows":38,"n_cols":27,"rows_kept":38,"cut":false,"hidden":false,"merged":[[0,0,0,23],[1,0,1,23],[2,0,2,23],[4,0,4,1],[4,2,4,9],[4,10,7,11],[4,13,4,16],[5,0,6,1],[5,2,6,8],[5,9,6,9],[5,12,6,23],[7,0,7,3],[7,4,7,9],[7,13,7,17],[7,19,7,23],[8,0,8,2],[8,3,9,9],[8,10,8,12],[8,13,9,23],[9,0,9,2],[9,10,9,12],[10,0,10,2],[10,3,10,9],[10,10,10,12],[10,13,10,23],[11,0,11,2],[11,3,12,9],[11,10,11,12],[11,13,12,23],[12,0,12,2],[12,10,12,12],[13,0,13,2],[13,3,13,9],[13,10,13,12],[13,13,13,23],[16,1,16,6],[16,7,16,9],[16,10,16,12],[16,13,16,15],[16,16,16,18],[16,19,16,22],[17,1,17,6],[17,7,17,9],[17,10,17,12],[17,13,17,15],[17,16,17,18],[14,1,14,6],[14,7,14,9],[14,10,14,12],[14,13,14,15],[14,16,14,18],[14,19,14,23],[15,1,15,6],[15,7,15,9],[15,10,15,12],[15,13,15,15],[15,16,15,18],[15,19,15,22],[19,1,19,6],[19,7,19,9],[19,10,19,12],[19,13,19,15],[19,16,19,18],[19,19,19,22],[17,19,17,22],[18,1,18,6],[18,7,18,9],[18,10,18,12],[18,13,18,15],[18,16,18,18],[18,19,18,22],[21,1,21,6],[21,7,21,9],[21,10,21,12],[21,13,21,15],[21,16,21,18],[21,19,21,22],[20,1,20,6],[20,7,20,9],[20,10,20,12],[20,13,20,15],[20,16,20,18],[20,19,20,22],[23,1,23,6],[23,7,23,9],[23,10,23,12],[23,13,23,15],[23,16,23,18],[23,19,23,22],[22,1,22,6],[22,7,22,9],[22,10,22,12],[22,13,22,15],[22,16,22,18],[22,19,22,22],[25,1,25,6],[25,7,25,9],[25,10,25,12],[25,13,25,15],[25,16,25,18],[25,19,25,22],[24,1,24,6],[24,7,24,9],[24,10,24,12],[24,13,24,15],[24,16,24,18],[24,19,24,22],[27,1,27,6],[27,7,27,9],[27,10,27,12],[27,13,27,15],[27,16,27,18],[27,19,27,22],[26,1,26,6],[26,7,26,9],[26,10,26,12],[26,13,26,15],[26,16,26,18],[26,19,26,22],[29,7,29,9],[29,10,29,12],[29,13,29,15],[29,16,29,18],[29,19,29,22],[28,1,28,6],[28,7,28,9],[28,10,28,12],[28,13,28,15],[28,16,28,18],[28,19,28,22],[14,25,14,26],[35,0,35,23],[36,0,36,1],[37,4,37,13],[37,14,37,21],[32,1,32,6],[32,7,32,9],[32,10,32,12],[32,13,32,15],[32,16,32,18],[32,19,32,22],[31,1,31,6],[31,7,31,9],[31,10,31,12],[31,13,31,15],[31,16,31,18],[31,19,31,22],[30,1,30,6],[30,7,30,9],[30,10,30,12],[30,13,30,15],[30,16,30,18],[30,19,30,22],[29,1,29,6]]}
[{"$f":"DBCS(TEXT(【入力1】チーム情報!H2, \"ggge年度　宮城県高等学校\"))","v":"令和６年度　宮城県高等学校"}]
["新人バスケットボール大会"]
["【　参加申込書　】"]
[null,null,null,null,null,null,null,null,null,null,null,null,null,null,null,null,null,null,null,null,null,null,null,{"$f":"【入力1】チーム情報!$H$6","v":"ver.2024_1a"}]
["ﾌﾘｶﾞﾅ",null,{"$f":"IFERROR(VLOOKUP(【入力1】チーム情報!$B$5,学校番号!$C$4:$M$173,10,1)&\" \"&VLOOKUP(【入力1】チーム情報!$B$5,学校番号!$C$4:$M$173,11,1),\"\")","v":""},null,null,null,null,null,null,null,"学校　　所在地",null,"〒",{"$f":"IFERROR(VLOOKUP(【入力1】チーム情報!$B$5,学校番号!$C$4:$M$173,5,1),\"\")","v":""}]
["学校名",null,{"$f":"IFERROR(VLOOKUP(【入力1】チーム情報!$B$5,学校番号!$C$4:$M$173,2,1),\"\")","v":""},null,null,null,null,null,null,{"$f":"IFERROR(VLOOKUP(【入力1】チーム情報!$B$5,学校番号!$C$4:$M$173,3,1)&\"子\",\"\")","v":""},null,null,{"$f":"IFERROR(VLOOKUP(【入力1】チーム情報!$B$5,学校番号!$C$4:$M$173,6,1),\"\")","v":""},null,null,null,null,null,null,null,null,null,null,null,null,{"$f":"VLOOKUP(【入力1】チーム情報!B5,学校番号!$C$4:$N$173,9,1)","v":{"$error":"#N/A"}}]
[]
["チーム登録番号",null,null,null,{"$f":"IFERROR(VLOOKUP(【入力1】チーム情報!$B$5,学校番号!$C$4:$M$173,4,1),\"\")","v":""},null,null,null,null,null,null,null,"TEL",{"$f":"IFERROR(VLOOKUP(【入力1】チーム情報!$B$5,学校番号!$C$4:$M$173,7,1),\"\")","v":""},null,null,null,null,"FAX",{"$f":"IFERROR(VLOOKUP(【入力1】チーム情報!$B$5,学校番号!$C$4:$M$173,8,1),\"\")","v":""}]
["監督",null,null,{"$f":"【入力1】チーム情報!$E$8","v":0},null,null,null,null,null,null,"コーチ",null,null,{"$f":"【入力1】チーム情報!$E$9","v":0}]
["氏名",null,null,null,null,null,null,null,null,null,"氏名"]
{"$rows_left_out":29}
{"sheet":"【メンバー用紙】共通","index":7,"n_rows":31,"n_cols":14,"rows_kept":31,"cut":false,"hidden":false,"merged":[[0,0,0,13],[1,0,1,13],[3,11,3,13],[2,0,2,13],[3,9,3,10],[3,6,3,7],[3,1,3,4],[4,0,4,4],[4,5,4,7],[4,8,4,10],[4,11,4,13],[5,0,6,0],[5,1,6,4],[5,5,6,5],[5,6,5,10],[5,11,5,13],[6,11,6,13],[7,11,7,13],[8,11,8,13],[9,11,9,13],[9,2,9,4],[8,2,8,4],[7,2,7,4],[10,11,10,13],[11,11,11,13],[12,11,12,13],[12,2,12,4],[11,2,11,4],[10,2,10,4],[13,11,13,13],[14,11,14,13],[15,11,15,13],[15,2,15,4],[14,2,14,4],[13,2,13,4],[16,11,16,13],[17,11,17,13],[18,11,18,13],[16,2,16,4],[18,2,18,4],[17,2,17,4],[19,11,19,13],[20,11,20,13],[21,11,21,13],[21,2,21,4],[20,2,20,4],[19,2,19,4],[27,0,27,1],[27,8,27,9],[28,0,28,1],[28,8,28,9],[22,11,22,13],[23,11,23,13],[24,11,24,13],[24,2,24,4],[23,2,23,4],[22,2,22,4]]}
["宮城県高体連バスケットボール専門部　メンバー用紙"]
["チーム名："]
[{"$f":"IFERROR(VLOOKUP(【入力1】チーム情報!$B$5,学校番号!$C$4:$L$173,2,1),\"\")","v":""}]
["監督:",{"$f":"RIGHT(【入力1】チーム情報!D8, 3)","v":""},null,null,null,"コーチ:",{"$f":"RIGHT(【入力1】チーム情報!D9, 3)","v":""},null,"Aコーチ:",{"$f":"RIGHT(【入力1】チーム情報!D10, 3)","v":""},null,"マネージャー："]
[{"$f":"【入力1】チーム情報!$E$8","v":0},null,null,null,null,{"$f":"【入力1】チーム情報!$E$9","v":0},null,null,{"$f":"【入力1】チーム情報!$E$10","v":0},null,null,{"$f":"【入力1】チーム情報!$E$11&\"  \"&【入力1】チーム情報!$E$12&\"  \"&【入力1】チーム情報!$E$13","v":"    "}]
["No.","選手名",null,null,null,"番号","ファウル",null,null,null,null,"備 考"]
[null,null,null,null,null,null,1,2,3,4,5,"（キャプテン等記入）"]
[1,{"$f":"RIGHT(【入力1】チーム情報!Q16, 3)","v":""},{"$f":"【入力1】チーム情報!M16","v":""},null,null,{"$f":"【入力1】チーム情報!L16","v":""}]
[2,{"$f":"RIGHT(【入力1】チーム情報!Q17, 3)","v":""},{"$f":"【入力1】チーム情報!M17","v":""},null,null,{"$f":"【入力1】チーム情報!L17","v":""}]
[3,{"$f":"RIGHT(【入力1】チーム情報!Q18, 3)","v":""},{"$f":"【入力1】チーム情報!M18","v":""},null,null,{"$f":"【入力1】チーム情報!L18","v":""},null,null,null,null,null,"　"]
{"$rows_left_out":22}
{"sheet":"memo","index":8,"n_rows":23,"n_cols":35,"rows_kept":23,"cut":false,"hidden":false,"merged":[]}
["このシートはご自由にご使用ください。"]
[]
["エントリーした選手が決まった際は、こちらを大会ごとの記録シートとしてお使いください。（削除可）"]
["総体地区予選",null,null,null,"県総体",null,null,null,"選手権一次大会",null,null,null,"新人地区予選",null,null,null,"選手権本大会",null,null,null,"県新人",null,null,null,"その他1",null,null,null,"その他2",null,null,null,"その他3"]
[null,"番号","エントリー選手",null,null,"番号","エントリー選手",null,null,"番号","エントリー選手",null,null,"番号","エントリー選手",null,null,"番号","エントリー選手",null,null,"番号","エントリー選手",null,null,"番号","エントリー選手",null,null,"番号","エントリー選手",null,null,"番号","エントリー選手"]
[1,null,null,null,1,null,null,null,1,null,null,null,1,null,null,null,1,null,null,null,1,null,null,null,1,null,null,null,1,null,null,null,1]
[2,null,null,null,2,null,null,null,2,null,null,null,2,null,null,null,2,null,null,null,2,null,null,null,2,null,null,null,2,null,null,null,2]
[3,null,null,null,3,null,null,null,3,null,null,null,3,null,null,null,3,null,null,null,3,null,null,null,3,null,null,null,3,null,null,null,3]
[4,null,null,null,4,null,null,null,4,null,null,null,4,null,null,null,4,null,null,null,4,null,null,null,4,null,null,null,4,null,null,null,4]
[5,null,null,null,5,null,null,null,5,null,null,null,5,null,null,null,5,null,null,null,5,null,null,null,5,null,null,null,5,null,null,null,5]
{"$rows_left_out":13}